Intranet Connections

Command phasescriptexecution failed with a nonzero exit code xcode

Command phasescriptexecution failed with a nonzero exit code xcode


Download the 101 Intranet Ideas eBook

it is working fine in my stimulater but when i try toSimple searches use one or more words. com> > >> On 1/11/2013 2:09 AM, Asmodehn Shade wrote: >> >>> Hello, >>> >>> I just had this happening with CMake 2. 5. fabric beta related issues & queries in StackoverflowXchanger. I must be missing something elementary here. Apple may provide or recommend responses as a possible solution based on the information provided; every potential issue may involve several factors not detailed in the conversations …I downloaded Xcode 7 beta 5, and I tried to compile my project with Xcode 7, and it worked. try restarting xcode. How does Fabric cli get ip of peer/orderer in the example of byfn? hyperledger-fabric Updated November 11, 2018 06:26 AM. hoffman at kitware. 3 and opened my old project and tried to build. 0 and after that I'm unable to create Command PhaseScriptExecution failed with a nonzero exit code Sep 24, 2018 Expected Behavior Run Xcode Build and get a compiled app. 0, and while compiling the error pops up stating that the Command PhaseScriptExecution failed with a May 31, 2017 xcodebuild -workspace [myworkspace] \ -scheme [myscheme] . However, when I create a Command Line Tool project in Xcode, add the library, provide paths to the header and library files, and attempt to build the project. update pod, try pod install in project folder, try install cocoapods in usr/local/binXcode 10 Command PhaseScriptExecution failed with a nonzero exit code (EXPANDED_CODE_SIGN_IDENTITY: unbound variable) Joining GoDaddy-issued . 0. But, I would like to, at least, use Xcode …on mac os x in xcode, I get the following error: "command /usr/bin/codesign failed with exit code 1". I get a failure. 2, since our dependent frameworks are not Swift 4. the simple solution is go the Build Phase-> then at bottom Expand the option Run Script -> and then …28/10/2018 · I ran into same problem this problems happen when you build your project on some another mac and export it to another mac and again open in xcode. This happens because of the order in which bash processes command …2013/1/14 Asmodehn Shade <asmodehn at gmail. Also make sure that the startup script that sets PATH is actually executed for non-interactive sessions. xcode 6 is not very stable right now. @hamed ok I did already update cocoa pods in terminal prior to running the project. xpc was invalidated Updated September 01, 2018 10:26 AM. Everything seems to be ok and the certs are being managed automatically be XCode. 1. Because Apple bundles/installs command line tools (git, llvm, clang, etc. If above method(s) doesn’t work and if for now you don’t feel like needing to test anything in your project, just remove your project test target. 0 answers 2 views 0 votes Xcode 10 - image literals no longer available xcode image beta xcode10 image-literals Updated November 09, 2018 02:26 AM. For now, I can confirm that what @ramirogm_palomonte wrote above is correct and should be enough to workaround this problem. command Command PhaseScriptExecution failed with a nonzero exit code Jul 22, 2018 The following build error occurs in Xcode 10 beta: Command CompileSwiftSources failed with a nonzero exit code Here is the full invocation: Oct 5, 2018 Command PhaseScriptExecution failed with a nonzero exit code #7 Messages : /Users/deepak/Library/Developer/Xcode/DerivedData/ Oct 23, 2018 I am trying to run my project in Xcode 10. Command PhaseScriptExecution emitted errors but did not return a nonzero exit code to indicate failure and then there are three “No such file or directory” errors beneath that which I …Xcode的项目,build和正常调试时是没问题的。Here are the steps I used to resolve this issue with cocoapods version 1. clang: error: linker command failed with exit code 1 (use -v to see invocation) In the link. extconf failed, exit code 1 Gem files will remain installed in Went back and did the command line install of compass with no errors. Execute below command in terminal. No reviews matched the request. Simple searches use one or more words. Hi, I have a simple CMakeLists. “Command /usr/bin/codesign failed with exit code 1” is published by Willy Wu10/03/2017 · I bought a new Macbook pro 2015 with Sierra installed . 1. GitHub is home to over 28 million developers working together to host and review code, manage projects, and build software together. 0 BETA 1 , I got my app (It was posted to the appstore and blah blah blah ) so I hope I can help you. Check the CODE_SIGN_IDENTITY property in your build settings. Hot Network Questions Shell: is it possible to delay a command without using `sleep`? How …Emin Kotan is a new contributor to this site. Xcode 10 Invalid binary architecture? Updated October 14, 2018 12:26 PM. Long story: Our project is not ready for Swift 4. Command PhaseScriptExecution failed with a nonzero exit code. 0 answers 4 views 0 votes Info. Level 1 (0 points)- Command /bin/sh failed with exit code 127 So, the things I try to fix these (but not working) are. command failed with exit code 1 (use -v to see invocation) Reminder? gcc is able to compile C++ code but the linking step fails. ) via Xcode. Related guide: Xcode exit code 65 / exit code 66 / raw-xcodebuild-output. Separate the words with spaces (cat dog) to search cat,dog or both. 1, Xcode Version 8. txt file compiling a single source via the generator Xcode I have been following recent conversation about CMakeLinux Shell Return Code 255 The exit status of an executed command is the value 0 and 255, though, as explained below, the shell may use. 13/10/2018 · Hi, sorry for this inconvenience We’re looking into this and will reach out to you once we find universal solution and fix it. So, after that, I used Xcode 7 to develop my application, but now, I want to back to Xcode 6 but when I try to build my project, I have this issue :export BUILD_DIR=/Users/desaro/Library/Developer/Xcode/DerivedData/luxe_test_draw-atdvdhrrtujxqkaqhwxemmvhwpnt/Build/ProductsFor example, previously, a message like “Command CompileSwiftSources failed with a nonzero exit code” could occur without an accompanying failure reason. Aside from building your app using the Xcode IDE, you also have the command …The content of this field is kept private and will not be shown publicly. Here are the steps I used to resolve this issue with cocoapods version 1. passing through Unity. Build was failed saying the message "Command /usr/bin/codesign failed with exit code …14/11/2018 · The xcode project is made without any issues but when I build it I have this error: Command PhaseScriptExecution failed with a nonzero exit code giorgos_gs , Oct 9, 2018 #[email protected] ok I did already update cocoa pods in terminal prior to running the project. 3. 2. 8. I have followed all the step describe in the docs: I have followed all the step describe in the docs: Apolo-IOS getting startedXcode 9: Provisioning profile is Xcode managed, but signing settings require a manually managed profile xcode itunesconnect provisioning-profile ios11 xcode9 asked Sep 22 '17 at 7:08Tour Start here for a quick overview of the site Help Center Detailed answers to any questions you might haveXcode 10 Command PhaseScriptExecution failed with a nonzero exit code (EXPANDED_CODE_SIGN_IDENTITY: unbound variable) at AllInOneScript. How to find the expired certificate and delete it using …Sometimes, however, ImageMagick returns nonzero exit codes when the command actually went ok. If you are sure that the command exists on the remote server, make sure that WinSCP (or rather the shell) can find it. 10 with Xcode 4. I have been usuing xcode 8. . Category Sports如果在Xcode遇到code sign failed的情況,可以試試以下方式去解決!. Some Framework or SDK require Code Signing. update pod, try pod install in project folder, try install cocoapods in usr/local/binXcode 10 Command PhaseScriptExecution failed with a nonzero exit code (EXPANDED_CODE_SIGN_IDENTITY: unbound variable)Command PhaseScriptExecution failed with a nonzero exit code It doesn't matter which framework is referenced as an input file - the outcome is the same. @nagarajaghantasala With Xcode 10/Swift 4. 6 and Xcode 7. the problem is to determine if the application properly returns 0 or 1 Exit codes. It seems that the problem is between the libraries of Cardboard 0. However I did not do it thru the xcode\downloads directory. log. implicit entry/start for main executable ld: symbol(s) not found for architecture x86_64 clang: error: linker command failed with exit code 1 (use -v to see invocation) My system is MacOS 10. Now it works. Xcode 10 Command PhaseScriptExecution failed with a nonzero exit code (EXPANDED_CODE_SIGN_IDENTITY: unbound variable) 0 Command PhaseScriptExecution failed with a nonzero exit code after adding firebaseXcode 10 Command PhaseScriptExecution failed with a nonzero exit code (EXPANDED_CODE_SIGN_IDENTITY: unbound variable) Command PhaseScriptExecution failed with a nonzero exit code Xcode 10. It seems file '/Users/steve/Library/Developer/Xcode/DerivedData/SwiftShot-  PhaseScriptExecution CMake\ Rules /Users/dan/dev/build/Xcode- . 3 (8E3004b) deleted the data of app in DerivedData folder. This site contains user submitted content, comments and opinions and is for informational purposes only. 0 and this was an app made with Cordova (not PhoneGap, Ionic, CocoonJS, etc which are all extensions of Cordova). 4 Build(Debug, Release) OK, But Archive fails with “directory not found for option. I've cleared DerivedData, checked KeyChain, rebooted, etc and even build a test project from scratch with the same result. I got that problem after updating to OS X Yosemite and Xcode 6. Separate the words with plus signs (cat +dog) to search for …Home; iPhone, iPad; try to fix "Command /bin/sh failed with exit code 1"in xcodeIf Android Studio doesn't bundle git, but expects it to exist on the system, it's an Xcode issue. 10 ( from a recent macports ) >>> and with XCode 4. key files into a complete . Check your Options in the drop-down menu of this sections header. xcode 6: Apple mach-o linker error; linker command failed with exit code 1 i am trying to create a archive of my ios project which created using xcode 6. I am very Shell Script Invocation Error: Command /bin/sh. (1 failure) utils/build-script: command terminated with a non-zero exit status 65, aborting. Command PhaseScriptExecution failed with a nonzero exit code Xcode 10 Updated September 26, 2018 …28/09/2015 · The version of XCode in this video is 7. the simple solution is go the Build Phase-> then at bottom Expand the option Run Script -> and then …« command compileassetcatalog failed with a nonzero exit code » I did a quick research on the web to try to find the problem, but there seem to be quite a lot of different things that may cause the issue. 2. apple. pfx / . 2, yet. About Jay Versluis. (43033749, 44362180) (43033749, 44362180) Long file paths containing white space no longer cause build failures. I'm trying to build a sample Apollo-IOS on Xcode 10. Separate the words with plus signs (cat +dog) to search for …shell command swallow the non-zero return. Latest reply on Aug 14, 2018 5:29 AM by bluemoon24 . Interestingly, when I switch on the Automatically manage signing option Xcode generates certificates. 6 answers 5671 views 24 votes What CDN do I use for an …Just found out a solution. /go, i'm said permission denied as i could understand, i have to add /dev/sdb2 /media/STOK vfat umask=0,user,defaults 0 0try switching to a different simulator. spc and . 1 gives errors like: linker command failed with exit code. Now all I get is a "codesign fail with exit code" with my macbook pro. I got error when I try make archive in xcode clang: error: linker command failed with exit code 1 (use -v to see invocation) what is the problem?Xcode 9 - linker command failed with exit code 1. com> > 2013/1/11 Bill Hoffman <bill. Command CompileSwiftSources failed with a nonzero exit code. I´m very new at Kivy, but I do have some Python and Xcode experience. com | Latest informal qu …Command PhaseScriptExecution failed with a nonzero exit code - EXPANDED_CODE_SIGN_IDENTITY #2087 Closed AlexeiGitH opened this Issue Nov …RobertGummesson changed the title from Command PhaseScriptExecution failed with a nonzero exit code to 'PhaseScriptExecution failed with a nonzero exit code' when a using greek symbol in target Apr 8, 2018[macOS Mojave bug?] Cocoapods "Command PhaseScriptExecution failed with a nonzero exit code" #174Controlling place holder text color from custom @IBDesignable UITextField class. in the swift project, i use "open quickly (shift+command+O)" to open swift declare file, but always open Objective-c file, how can I open swift declare file?Command CodeSign failed with nonzero exit code Level 9 (12,955 points) KMT Jul 23, 2018 8:03 PM ( in response to Jagruth Vamsi )App to Find Duplicate Photos in Mac OS I had a project which was building and running successfully with XCode 8. Install zlib1g-dev to get rid of error: “/usr/bin/ld: cannot find -lz”. Removing the modulemap solves the collision. Apple Footer. Take care in asking for clarification, commenting, and answering. Xcode 10 Command PhaseScriptExecution failed with a nonzero exit code (EXPANDED_CODE_SIGN_IDENTITY: unbound variable)28/10/2018 · I ran into same problem this problems happen when you build your project on some another mac and export it to another mac and again open in xcode. Apple disclaims any and all liability for the acts, omissions and conduct of any third parties in connection with or related to your use of the site. 6. xattr -cr <path_to_app_bundle> Clean Xcode and Re Build. /go, i'm said permission denied as i could understand, i have to add /dev/sdb2 /media/STOK vfat umask=0,user,defaults 0 0No reviews matched the request. Jay is the founder of Pinkstone Pictures and WP Hosting. Home » Javascript » Nativescript ios – Command xcodebuild failed with exit code null Nativescript ios – Command xcodebuild failed with exit code null Posted by: admin May 1, 2018 Leave a commentSolution 1: Apple Developer Website Answers above problem Here. I have to remove sqlcipher from the list of frameworks and add it again. I have had a lot of issues with the simulator. Some time later I have update the Xcode to version 8. The pod that I was using was not updated for Xcode 10, so the solution that worked for me Sep 20, 2018 I have recently updated the Xcode to 10. However Provisional Profiles can't seem to find certificates. 2, Xcode 10 Updated September 23, 2018 14:26 PMCodeSign failed with a nonzero exit code (Signal 4) 735 Views 0 Replies. 4. I will try that then see how it goessetenv BUILD_ROOT /Users/mac/Library/Developer/Xcode/DerivedData/RestKitTutorial-guglmzdxnxxkccezgqndsookgysd/Build/Products如果在Xcode遇到code sign failed的情況,可以試試以下方式去解決!. 11 b9Short story: Xcode 10 is set to Swift 4, but it is using Swift 4. Check out our Code of Conduct. I will try that then see how it goes- Command /bin/sh failed with exit code 127 So, the things I try to fix these (but not working) are. codesign failed with exit code 1 - iOS - posted in CoronaCards for iOS / Android: I admit Im newer to Xcode, so this might be some small thing Im just missing (or is one cited problem peopleCMake 2. txt file compiling a single source via the generator Xcode I have been following recent conversation about CMakeSo when I run my project in the simulator in Xcode (latest version not beta) everything works aside from a couple things; I have an overlay for high scores with a …XCode: error: linker command failed with exit code 1 (use -v to see invocation) I am working on a project, and when I build the project, I got an issue which is the following:Hi. ”26/10/2015 · Question: Q: Xcode 7: Linker command failed with exit code 1 More Less. 2, CommonCrypto is exposed natively as part of Swift (for Apple platforms only), rendering the included modulemap unnecessary and causing a name collision. commcenter. Command /usr/bin/codesign failed with exit code 1. A Unix script A Unix script running to completion will return the status of the last command executed. 14, XCode Version 10. coretelephony. A suite of fast-running functional tests proofs your work as you go and ensures solid app foundations thatCMake 2. Is your provisioning profile selected there?to build gem native extension. 0 and then come back to your xcode in the targets select your target app and in linked Frameworks and Libraries (the last one down) see if there's any pods with light color and a strange name than your target in the podfile and remove it using the minus button down . Latest reply on Jun 19, 2018 1:39 AM by Kregus . 1 answers 43 views 0 votes The connection to service named com. I done code signing and resolved the similar problem for me. “Command /usr/bin/codesign failed with exit code 1” is published by Willy Wu15/11/2018 · At the moment I can compile it only with Xcode 7. 2 days ago · Command bin/sh failed with exit code 1 Unrecognized arguments: 0 Xcode 9. You may need to add path to the command to PATH environment variable. Runs fine on several Error: Command CodeSign failed with a nonzero exit code. 1 (10B61), visual studio 7. This particular exit code is fun because xcodebuild doesn’t tell you what the problem is. Swift 4. Error: Command CodeSign failed with a nonzero exit code after installing Xcode10 beta 5? 8 Xcode 10 Command PhaseScriptExecution failed with a nonzero exit code (EXPANDED_CODE_SIGN_IDENTITY: unbound variable)Command PhaseScriptExecution failed with a nonzero exit code - EXPANDED_CODE_SIGN_IDENTITY #2087 Closed AlexeiGitH opened this Issue Nov …Join GitHub today. No errors. 1 with my macbook air with El Capitan and no problems. cer certificateJoin GitHub today. 7/04/2013 · Hello please help me with this problem, hope you can and maybe record video response. He has been developing iOS Apps since 2011, several of which have made it to the App Store. 9/11/2018 · This site contains user submitted content, comments and opinions and is for informational purposes only. Level 1 (0 points) bluemoon24 Aug 14, 2018 5:29 AM I created a simple HelloWorld test app and try to run it on my own device with a developer cert (paid). if that doesnt work quit the simulator and try running it again. 6 answers 5671 views 24 votes What CDN do I use for an …Command PhaseScriptExecution failed with a nonzero exit code!!! Can somebody help me with this error? Can somebody help me with this error? Posted November 19, …22/11/2018 · Command PhaseScriptExecution failed with a nonzero exit code!!! Can somebody help me with this error? Can somebody help me with this error? Posted November 19, …hello i'm trying to execute a shell script, typing . In these cases, to avoid raising errors, you can add the following configuration: In these cases, to avoid raising errors, you can add the following configuration:XCode: error: linker command failed with exit code 1 (use -v to see invocation) I am working on a project, and when I build the project, I got an issue which is the following:However, when I create a Command Line Tool project in Xcode, add the library, provide paths to the header and library files, and attempt to build the project. 24/01/2017 · The Xcode testing capabilities, used interactively, ensure that your code stays on track with respect to its specified requirements and ensure that bugs which develop are easy to find and fix. by sunilkumar Last Updated October 28, 2018 20:26 PM . How I hate this Xcode linker businesshello i'm trying to execute a shell script, typing . Command /usr/bin/codesign failed with exit code 4 1762 Views 10 Replies. txt file for this example, it only links to png lib but not jpeg lib: statically compiled the copy of libjpeg25/09/2011 · How to find the ambiguous certificate that is causing codesign to fail when building in xcode. 1, Xcode 7. plist: Permission denied